{"text_format":"1","workbook":"xlsx","n_sheets":7,"sheets":["Sheet1","Sprints1","Sprints2","DistanceRaces","Field","Instructions","Competitors&Timetable"],"not_rendered":{"charts":0,"images":0,"macros":1,"external_links":1,"defined_names":53,"comments":0,"pivot_tables":0},"unopened":[],"bounds":{"document_bytes":16777216,"sheet_cells":100000,"rows_first":2000,"rows_last":500,"rows_between":2000,"halvings":0,"cell_chars":16384,"cell_head_chars":4096},"cells_cut":0,"cells_raw":0,"read":"whole","date_system":"1900"}

{"sheet":"Sheet1","index":0,"n_rows":0,"n_cols":0,"rows_kept":0,"cut":false,"hidden":false,"merged":[]}

{"sheet":"Sprints1","index":1,"n_rows":175,"n_cols":12,"rows_kept":175,"cut":false,"hidden":false,"merged":[[0,2,0,3],[0,8,0,9],[11,2,11,3],[11,8,11,9],[22,8,22,9],[22,2,22,3],[33,2,33,3],[45,2,45,3],[55,2,55,3],[55,8,55,9],[66,2,66,3],[66,8,66,9],[33,8,33,9],[45,8,45,9],[77,2,77,3],[88,2,88,3],[99,2,99,3],[99,8,99,9],[110,2,110,3],[110,8,110,9],[77,8,77,9],[154,2,154,3],[154,8,154,9],[165,2,165,3],[165,8,165,9],[121,2,121,3],[121,8,121,9],[132,2,132,3],[132,8,132,9],[143,2,143,3],[143,8,143,9]]}
[null,"T01",{"$f":"INDEX('Competitors&Timetable'!$F$1:$H$144,MATCH(B1,'Competitors&Timetable'!$F$1:$F$144,0),2)","v":"70m Hurdles Under 13 Girls"},null,"Heat 1",null,null,"T01",{"$f":"INDEX('Competitors&Timetable'!F1:H144,MATCH(H1,'Competitors&Timetable'!F1:F144,0),2)","v":"70m Hurdles Under 13 Girls"},null,"Heat 2"]
[1,35,{"$f":"INDEX(EntryList,MATCH(B2,'Competitors&Timetable'!$A$1:$A$401,0),2)","v":"Shona Gristwood"},{"$f":"INDEX(EntryList,MATCH(B2,'Competitors&Timetable'!$A$1:$A$401,0),3)","v":"U13 Girl"},15.06,17,1,37,{"$f":"INDEX(EntryList,MATCH(H2,'Competitors&Timetable'!A1:A401,0),2)","v":"Sarah Robertson"},{"$f":"INDEX(EntryList,MATCH(H2,'Competitors&Timetable'!A1:A401,0),3)","v":"U13 Girl"},12.35,38]
[2,30,{"$f":"INDEX(EntryList,MATCH(B3,'Competitors&Timetable'!A1:A401,0),2)","v":"Rachel  Cartledge"},{"$f":"INDEX(EntryList,MATCH(B3,'Competitors&Timetable'!A1:A401,0),3)","v":"U13 Girl"},15.38,16,2,25,{"$f":"INDEX(EntryList,MATCH(H3,'Competitors&Timetable'!A1:A401,0),2)","v":"Katy Martin"},{"$f":"INDEX(EntryList,MATCH(H3,'Competitors&Timetable'!A1:A401,0),3)","v":"U13 Girl"},12.57,34]
[3,33,{"$f":"INDEX(EntryList,MATCH(B4,'Competitors&Timetable'!A1:A401,0),2)","v":"Laura Yapp"},{"$f":"INDEX(EntryList,MATCH(B4,'Competitors&Timetable'!A1:A401,0),3)","v":"U13 Girl"},15.41,16,3,87,{"$f":"INDEX(EntryList,MATCH(H4,'Competitors&Timetable'!A1:A401,0),2)","v":"Olivia Harris"},{"$f":"INDEX(EntryList,MATCH(H4,'Competitors&Timetable'!A1:A401,0),3)","v":"U13 Girl"},12.86,28]
[4,26,{"$f":"INDEX(EntryList,MATCH(B5,'Competitors&Timetable'!A1:A401,0),2)","v":"Amy Hewitt"},{"$f":"INDEX(EntryList,MATCH(B5,'Competitors&Timetable'!A1:A401,0),3)","v":"U13 Girl"},16.649999999999999,11,4,24,{"$f":"INDEX(EntryList,MATCH(H5,'Competitors&Timetable'!A1:A401,0),2)","v":"Rachel  Elder"},{"$f":"INDEX(EntryList,MATCH(H5,'Competitors&Timetable'!A1:A401,0),3)","v":"U13 Girl"},13.13,25]
[null,".",{"$f":"INDEX(EntryList,MATCH(B6,'Competitors&Timetable'!A1:A401,0),2)","v":" "},{"$f":"INDEX(EntryList,MATCH(B6,'Competitors&Timetable'!A1:A401,0),3)","v":" "},null,null,5,27,{"$f":"INDEX(EntryList,MATCH(H6,'Competitors&Timetable'!A1:A401,0),2)","v":"Lucy Tod"},{"$f":"INDEX(EntryList,MATCH(H6,'Competitors&Timetable'!A1:A401,0),3)","v":"U13 Girl"},13.48,24]
[null,".",{"$f":"INDEX(EntryList,MATCH(B7,'Competitors&Timetable'!A1:A401,0),2)","v":" "},{"$f":"INDEX(EntryList,MATCH(B7,'Competitors&Timetable'!A1:A401,0),3)","v":" "},null,null,null,".",{"$f":"INDEX(EntryList,MATCH(H7,'Competitors&Timetable'!A1:A401,0),2)","v":" "},{"$f":"INDEX(EntryList,MATCH(H7,'Competitors&Timetable'!A1:A401,0),3)","v":" "}]
[null,".",{"$f":"INDEX(EntryList,MATCH(B8,'Competitors&Timetable'!A1:A401,0),2)","v":" "},{"$f":"INDEX(EntryList,MATCH(B8,'Competitors&Timetable'!A1:A401,0),3)","v":" "},null,null,null,".",{"$f":"INDEX(EntryList,MATCH(H8,'Competitors&Timetable'!A1:A401,0),2)","v":" "},{"$f":"INDEX(EntryList,MATCH(H8,'Competitors&Timetable'!A1:A401,0),3)","v":" "}]
[null,".",{"$f":"INDEX(EntryList,MATCH(B9,'Competitors&Timetable'!A1:A401,0),2)","v":" "},{"$f":"INDEX(EntryList,MATCH(B9,'Competitors&Timetable'!A1:A401,0),3)","v":" "},null,null,null,".",{"$f":"INDEX(EntryList,MATCH(H9,'Competitors&Timetable'!A1:A401,0),2)","v":" "},{"$f":"INDEX(EntryList,MATCH(H9,'Competitors&Timetable'!A1:A401,0),3)","v":" "}]
[null,null,{"$f":"IF(B10=\"\",\"\",LOOKUP(B10,#REF!,#REF!))","v":""},{"$f":"IF(B10=\"\",\"\",LOOKUP(B10,'Competitors&Timetable'!#REF!))","v":""},null,null,null,null,{"$f":"IF(H10=\"\",\"\",LOOKUP(H10,#REF!,#REF!))","v":""},{"$f":"IF(H10=\"\",\"\",LOOKUP(H10,'Competitors&Timetable'!#REF!))","v":""}]
{"$rows_left_out":166}
{"sheet":"Sprints2","index":2,"n_rows":153,"n_cols":15,"rows_kept":153,"cut":false,"hidden":false,"merged":[[0,5,0,6],[0,11,0,12],[11,5,11,6],[11,11,11,12],[22,5,22,6],[22,11,22,12],[33,5,33,6],[33,11,33,12],[44,5,44,6],[44,11,44,12],[55,5,55,6],[55,11,55,12],[66,5,66,6],[66,11,66,12],[77,5,77,6],[77,11,77,12],[88,5,88,6],[88,11,88,12],[132,5,132,6],[132,11,132,12],[143,5,143,6],[143,11,143,12],[99,5,99,6],[99,11,99,12],[110,5,110,6],[110,11,110,12],[121,5,121,6],[121,11,121,12]]}
[{"$f":"#REF!","v":{"$error":"#REF!"}},{"$f":"#REF!","v":{"$error":"#REF!"}},{"$f":"#REF!","v":{"$error":"#REF!"}},null,"T14",{"$f":"INDEX('Competitors&Timetable'!F1:H144,MATCH(E1,'Competitors&Timetable'!F1:F144,0),2)","v":"300m Under 15 Girls/Under 17 Women"},null,"Final",null,null,"T15",{"$f":"INDEX('Competitors&Timetable'!F1:H144,MATCH(K1,'Competitors&Timetable'!F1:F144,0),2)","v":"400m Under 15 Boys & Senior Women"},null,"Final"]
[{"$f":"#REF!","v":{"$error":"#REF!"}},{"$f":"#REF!","v":{"$error":"#REF!"}},{"$f":"#REF!","v":{"$error":"#REF!"}},1,52,{"$f":"INDEX(EntryList,MATCH(E2,'Competitors&Timetable'!A1:A401,0),2)","v":"Rachel Louden"},{"$f":"INDEX(EntryList,MATCH(E2,'Competitors&Timetable'!A1:A401,0),3)","v":"U15 Girl"},45.92,32,1,65,{"$f":"INDEX(EntryList,MATCH(K2,'Competitors&Timetable'!A1:A401,0),2)","v":"Cameron Steven"},{"$f":"INDEX(EntryList,MATCH(K2,'Competitors&Timetable'!A1:A401,0),3)","v":"U15 Boy"},59.16,36]
[{"$f":"#REF!","v":{"$error":"#REF!"}},{"$f":"#REF!","v":{"$error":"#REF!"}},{"$f":"#REF!","v":{"$error":"#REF!"}},2,56,{"$f":"INDEX(EntryList,MATCH(E3,'Competitors&Timetable'!A1:A401,0),2)","v":"Rachel Hutchison"},{"$f":"INDEX(EntryList,MATCH(E3,'Competitors&Timetable'!A1:A401,0),3)","v":"U15 Girl"},46.61,30,2,60,{"$f":"INDEX(EntryList,MATCH(K3,'Competitors&Timetable'!A1:A401,0),2)","v":"Jamie Darling"},{"$f":"INDEX(EntryList,MATCH(K3,'Competitors&Timetable'!A1:A401,0),3)","v":"U15 Boy"},"1:01.42",32]
[{"$f":"#REF!","v":{"$error":"#REF!"}},{"$f":"#REF!","v":{"$error":"#REF!"}},{"$f":"#REF!","v":{"$error":"#REF!"}},1,68,{"$f":"INDEX(EntryList,MATCH(E4,'Competitors&Timetable'!A1:A401,0),2)","v":"Sophie Miller"},{"$f":"INDEX(EntryList,MATCH(E4,'Competitors&Timetable'!A1:A401,0),3)","v":"U17 Woman"},46.68,30,3,64,{"$f":"INDEX(EntryList,MATCH(K4,'Competitors&Timetable'!A1:A401,0),2)","v":"Lewis Donaldson"},{"$f":"INDEX(EntryList,MATCH(K4,'Competitors&Timetable'!A1:A401,0),3)","v":"U15 Boy"},"1:09.19",23]
[{"$f":"#REF!","v":{"$error":"#REF!"}},{"$f":"#REF!","v":{"$error":"#REF!"}},{"$f":"#REF!","v":{"$error":"#REF!"}},3,49,{"$f":"INDEX(EntryList,MATCH(E5,'Competitors&Timetable'!A1:A401,0),2)","v":"Lauren Dickson"},{"$f":"INDEX(EntryList,MATCH(E5,'Competitors&Timetable'!A1:A401,0),3)","v":"U15 Girl"},48,27,4,63,{"$f":"INDEX(EntryList,MATCH(K5,'Competitors&Timetable'!A1:A401,0),2)","v":"Ross Mackenzie"},{"$f":"INDEX(EntryList,MATCH(K5,'Competitors&Timetable'!A1:A401,0),3)","v":"U15 Boy"},"1:18.84",16]
[{"$f":"#REF!","v":{"$error":"#REF!"}},{"$f":"#REF!","v":{"$error":"#REF!"}},{"$f":"#REF!","v":{"$error":"#REF!"}},4,58,{"$f":"INDEX(EntryList,MATCH(E6,'Competitors&Timetable'!A1:A401,0),2)","v":"Lauren Wilkie"},{"$f":"INDEX(EntryList,MATCH(E6,'Competitors&Timetable'!A1:A401,0),3)","v":"U15 Girl"},56.27,18,1,83,{"$f":"INDEX(EntryList,MATCH(K6,'Competitors&Timetable'!A1:A401,0),2)","v":"Karen McKinlay"},{"$f":"INDEX(EntryList,MATCH(K6,'Competitors&Timetable'!A1:A401,0),3)","v":"Sen Women"},"1:20.63",10]
[{"$f":"#REF!","v":{"$error":"#REF!"}},{"$f":"#REF!","v":{"$error":"#REF!"}},{"$f":"#REF!","v":{"$error":"#REF!"}},null,".",{"$f":"INDEX(EntryList,MATCH(E7,'Competitors&Timetable'!A1:A401,0),2)","v":" "},{"$f":"INDEX(EntryList,MATCH(E7,'Competitors&Timetable'!A1:A401,0),3)","v":" "},null,null,null,".",{"$f":"INDEX(EntryList,MATCH(K7,'Competitors&Timetable'!A1:A401,0),2)","v":" "},{"$f":"INDEX(EntryList,MATCH(K7,'Competitors&Timetable'!A1:A401,0),3)","v":" "}]
[{"$f":"#REF!","v":{"$error":"#REF!"}},{"$f":"#REF!","v":{"$error":"#REF!"}},{"$f":"#REF!","v":{"$error":"#REF!"}},null,".",{"$f":"INDEX(EntryList,MATCH(E8,'Competitors&Timetable'!A1:A401,0),2)","v":" "},{"$f":"INDEX(EntryList,MATCH(E8,'Competitors&Timetable'!A1:A401,0),3)","v":" "},null,null,null,".",{"$f":"INDEX(EntryList,MATCH(K8,'Competitors&Timetable'!A1:A401,0),2)","v":" "},{"$f":"INDEX(EntryList,MATCH(K8,'Competitors&Timetable'!A1:A401,0),3)","v":" "}]
[{"$f":"#REF!","v":{"$error":"#REF!"}},{"$f":"#REF!","v":{"$error":"#REF!"}},{"$f":"#REF!","v":{"$error":"#REF!"}},null,".",{"$f":"INDEX(EntryList,MATCH(E9,'Competitors&Timetable'!A1:A401,0),2)","v":" "},{"$f":"INDEX(EntryList,MATCH(E9,'Competitors&Timetable'!A1:A401,0),3)","v":" "},null,null,null,".",{"$f":"INDEX(EntryList,MATCH(K9,'Competitors&Timetable'!A1:A401,0),2)","v":" "},{"$f":"INDEX(EntryList,MATCH(K9,'Competitors&Timetable'!A1:A401,0),3)","v":" "}]
[{"$f":"#REF!","v":{"$error":"#REF!"}},{"$f":"#REF!","v":{"$error":"#REF!"}},{"$f":"#REF!","v":{"$error":"#REF!"}},null,null,{"$f":"IF(E10=\"\",\"\",LOOKUP(E10,#REF!,#REF!))","v":""},{"$f":"IF(E10=\"\",\"\",LOOKUP(E10,'Competitors&Timetable'!#REF!))","v":""},null,null,null,null,{"$f":"IF(K10=\"\",\"\",LOOKUP(K10,#REF!,#REF!))","v":""},{"$f":"IF(K10=\"\",\"\",LOOKUP(K10,'Competitors&Timetable'!#REF!))","v":""}]
{"$rows_left_out":144}
{"sheet":"DistanceRaces","index":3,"n_rows":154,"n_cols":15,"rows_kept":154,"cut":false,"hidden":false,"merged":[[78,5,78,6],[67,11,67,12],[78,11,78,12],[0,5,0,6],[11,5,11,6],[0,11,0,12],[11,11,11,12],[22,5,22,6],[34,5,34,6],[22,11,22,12],[34,11,34,12],[45,5,45,6],[56,5,56,6],[45,11,45,12],[56,11,56,12],[67,5,67,6],[133,5,133,6],[133,11,133,12],[144,5,144,6],[144,11,144,12],[89,5,89,6],[100,5,100,6],[89,11,89,12],[100,11,100,12],[111,5,111,6],[122,5,122,6],[111,11,111,12],[122,11,122,12]]}
[{"$f":"#REF!","v":{"$error":"#REF!"}},{"$f":"#REF!","v":{"$error":"#REF!"}},{"$f":"#REF!","v":{"$error":"#REF!"}},null,"T12",{"$f":"INDEX('Competitors&Timetable'!F1:H144,MATCH(E1,'Competitors&Timetable'!F1:F144,0),2)","v":"1500m Under 13 G/B & Under 15 Girls"},null,null,null,null,"T13",{"$f":"INDEX('Competitors&Timetable'!F1:H144,MATCH(K1,'Competitors&Timetable'!F1:F144,0),2)","v":"1500m Under 15/17/Sen Men/Women"}]
[{"$f":"#REF!","v":{"$error":"#REF!"}},{"$f":"#REF!","v":{"$error":"#REF!"}},{"$f":"#REF!","v":{"$error":"#REF!"}},1,40,{"$f":"INDEX(EntryList,MATCH(E2,'Competitors&Timetable'!A1:A401,0),2)","v":"Magnus Tait"},{"$f":"INDEX(EntryList,MATCH(E2,'Competitors&Timetable'!A1:A401,0),3)","v":"U13 Boy"},"00:04:55.040",37,1,80,{"$f":"INDEX(EntryList,MATCH(K2,'Competitors&Timetable'!A1:A401,0),2)","v":"Rowan Marr"},{"$f":"INDEX(EntryList,MATCH(K2,'Competitors&Timetable'!A1:A401,0),3)","v":"U20 Men"},"00:04:22.670",50]
[{"$f":"#REF!","v":{"$error":"#REF!"}},{"$f":"#REF!","v":{"$error":"#REF!"}},{"$f":"#REF!","v":{"$error":"#REF!"}},1,49,{"$f":"INDEX(EntryList,MATCH(E3,'Competitors&Timetable'!A1:A401,0),2)","v":"Lauren Dickson"},{"$f":"INDEX(EntryList,MATCH(E3,'Competitors&Timetable'!A1:A401,0),3)","v":"U15 Girl"},"00:04:56.390",37,1,65,{"$f":"INDEX(EntryList,MATCH(K3,'Competitors&Timetable'!A1:A401,0),2)","v":"Cameron Steven"},{"$f":"INDEX(EntryList,MATCH(K3,'Competitors&Timetable'!A1:A401,0),3)","v":"U15 Boy"},"00:04:36.610",43]
[{"$f":"#REF!","v":{"$error":"#REF!"}},{"$f":"#REF!","v":{"$error":"#REF!"}},{"$f":"#REF!","v":{"$error":"#REF!"}},1,29,{"$f":"INDEX(EntryList,MATCH(E4,'Competitors&Timetable'!A1:A401,0),2)","v":"Sarah Tait"},{"$f":"INDEX(EntryList,MATCH(E4,'Competitors&Timetable'!A1:A401,0),3)","v":"U13 Girl"},"00:05:16.120",31,1,73,{"$f":"INDEX(EntryList,MATCH(K4,'Competitors&Timetable'!A1:A401,0),2)","v":"Kyle Mackenzie"},{"$f":"INDEX(EntryList,MATCH(K4,'Competitors&Timetable'!A1:A401,0),3)","v":"U17 Men"},"00:04:59.260",36]
[{"$f":"#REF!","v":{"$error":"#REF!"}},{"$f":"#REF!","v":{"$error":"#REF!"}},{"$f":"#REF!","v":{"$error":"#REF!"}},2,58,{"$f":"INDEX(EntryList,MATCH(E5,'Competitors&Timetable'!A1:A401,0),2)","v":"Lauren Wilkie"},{"$f":"INDEX(EntryList,MATCH(E5,'Competitors&Timetable'!A1:A401,0),3)","v":"U15 Girl"},"00:05:49.320",25,1,81,{"$f":"INDEX(EntryList,MATCH(K5,'Competitors&Timetable'!A1:A401,0),2)","v":"Amy Frankland"},{"$f":"INDEX(EntryList,MATCH(K5,'Competitors&Timetable'!A1:A401,0),3)","v":"U20 Women"},"00:05:14.490",32]
[{"$f":"#REF!","v":{"$error":"#REF!"}},{"$f":"#REF!","v":{"$error":"#REF!"}},{"$f":"#REF!","v":{"$error":"#REF!"}},2,32,{"$f":"INDEX(EntryList,MATCH(E6,'Competitors&Timetable'!A1:A401,0),2)","v":"Eilidh Brown"},{"$f":"INDEX(EntryList,MATCH(E6,'Competitors&Timetable'!A1:A401,0),3)","v":"U13 Girl"},"00:06:19.570",19,null,".",{"$f":"INDEX(EntryList,MATCH(K6,'Competitors&Timetable'!A1:A401,0),2)","v":" "},{"$f":"INDEX(EntryList,MATCH(K6,'Competitors&Timetable'!A1:A401,0),3)","v":" "}]
[{"$f":"#REF!","v":{"$error":"#REF!"}},{"$f":"#REF!","v":{"$error":"#REF!"}},{"$f":"#REF!","v":{"$error":"#REF!"}},null,".",{"$f":"INDEX(EntryList,MATCH(E7,'Competitors&Timetable'!A1:A401,0),2)","v":" "},{"$f":"INDEX(EntryList,MATCH(E7,'Competitors&Timetable'!A1:A401,0),3)","v":" "},null,null,null,".",{"$f":"INDEX(EntryList,MATCH(K7,'Competitors&Timetable'!A1:A401,0),2)","v":" "},{"$f":"INDEX(EntryList,MATCH(K7,'Competitors&Timetable'!A1:A401,0),3)","v":" "}]
[{"$f":"#REF!","v":{"$error":"#REF!"}},{"$f":"#REF!","v":{"$error":"#REF!"}},{"$f":"#REF!","v":{"$error":"#REF!"}},null,".",{"$f":"INDEX(EntryList,MATCH(E8,'Competitors&Timetable'!A1:A401,0),2)","v":" "},{"$f":"INDEX(EntryList,MATCH(E8,'Competitors&Timetable'!A1:A401,0),3)","v":" "},null,null,null,".",{"$f":"INDEX(EntryList,MATCH(K8,'Competitors&Timetable'!A1:A401,0),2)","v":" "},{"$f":"INDEX(EntryList,MATCH(K8,'Competitors&Timetable'!A1:A401,0),3)","v":" "}]
[{"$f":"#REF!","v":{"$error":"#REF!"}},{"$f":"#REF!","v":{"$error":"#REF!"}},{"$f":"#REF!","v":{"$error":"#REF!"}},null,".",{"$f":"INDEX(EntryList,MATCH(E9,'Competitors&Timetable'!A1:A401,0),2)","v":" "},{"$f":"INDEX(EntryList,MATCH(E9,'Competitors&Timetable'!A1:A401,0),3)","v":" "},null,null,null,".",{"$f":"INDEX(EntryList,MATCH(K9,'Competitors&Timetable'!A1:A401,0),2)","v":" "},{"$f":"INDEX(EntryList,MATCH(K9,'Competitors&Timetable'!A1:A401,0),3)","v":" "}]
[{"$f":"#REF!","v":{"$error":"#REF!"}},{"$f":"#REF!","v":{"$error":"#REF!"}},{"$f":"#REF!","v":{"$error":"#REF!"}},null,null,{"$f":"IF(E10=\"\",\"\",LOOKUP(E10,#REF!,#REF!))","v":""},{"$f":"IF(E10=\"\",\"\",LOOKUP(E10,'Competitors&Timetable'!#REF!))","v":""},null,null,null,null,{"$f":"IF(K10=\"\",\"\",LOOKUP(K10,#REF!,#REF!))","v":""},{"$f":"IF(K10=\"\",\"\",LOOKUP(K10,'Competitors&Timetable'!#REF!))","v":""}]
{"$rows_left_out":145}
{"sheet":"Field","index":4,"n_rows":432,"n_cols":15,"rows_kept":432,"cut":false,"hidden":false,"merged":[[411,5,411,6],[411,11,411,12],[422,5,422,6],[422,11,422,12],[389,5,389,6],[389,11,389,12],[400,11,400,12],[400,5,400,6],[356,5,356,6],[356,11,356,12],[367,5,367,6],[378,5,378,6],[378,11,378,12],[367,11,367,12],[345,11,345,12],[334,5,334,6],[334,11,334,12],[48,5,48,6],[48,11,48,12],[59,5,59,6],[70,5,70,6],[81,5,81,6],[92,5,92,6],[103,5,103,6],[257,11,257,12],[268,5,268,6],[268,11,268,12],[235,5,235,6],[235,11,235,12],[59,11,59,12],[0,5,0,6],[11,5,11,6],[26,5,26,6],[37,5,37,6],[345,5,345,6],[279,5,279,6],[290,5,290,6],[180,5,180,6],[257,5,257,6],[136,5,136,6],[114,5,114,6],[246,5,246,6],[70,11,70,12],[81,11,81,12],[92,11,92,12],[0,11,0,12],[11,11,11,12],[26,11,26,12],[37,11,37,12],[224,5,224,6],[224,11,224,12],[191,5,191,6],[191,11,191,12],[202,5,202,6],[202,11,202,12],[158,5,158,6],[147,5,147,6],[169,5,169,6],[103,11,103,12],[213,5,213,6],[213,11,213,12],[125,5,125,6],[290,11,290,12],[114,11,114,12],[125,11,125,12],[136,11,136,12],[147,11,147,12],[158,11,158,12],[169,11,169,12],[180,11,180,12],[279,11,279,12],[246,11,246,12]]}
[{"$f":"#REF!","v":{"$error":"#REF!"}},{"$f":"#REF!","v":{"$error":"#REF!"}},{"$f":"#REF!","v":{"$error":"#REF!"}},null,"F01",{"$f":"INDEX('Competitors&Timetable'!$F$1:$H$144,MATCH(E1,'Competitors&Timetable'!$F$1:$F$144,0),2)","v":"Long Jump Under 11 Girls"},null,null,null,null,"F01",{"$f":"INDEX('Competitors&Timetable'!F1:H144,MATCH(K1,'Competitors&Timetable'!F1:F144,0),2)","v":"Long Jump Under 11 Girls"}]
[{"$f":"#REF!","v":{"$error":"#REF!"}},{"$f":"#REF!","v":{"$error":"#REF!"}},{"$f":"#REF!","v":{"$error":"#REF!"}},null,12,{"$f":"INDEX(EntryList,MATCH(E2,'Competitors&Timetable'!$A$1:$A$401,0),2)","v":"Abbie Malinowski"},{"$f":"INDEX(EntryList,MATCH(E2,'Competitors&Timetable'!$A$1:$A$401,0),3)","v":"U11 Girl"},"3;13",11]
[{"$f":"#REF!","v":{"$error":"#REF!"}},{"$f":"#REF!","v":{"$error":"#REF!"}},{"$f":"#REF!","v":{"$error":"#REF!"}},null,13,{"$f":"INDEX(EntryList,MATCH(E3,'Competitors&Timetable'!$A$1:$A$401,0),2)","v":"Rachel Mair"},{"$f":"INDEX(EntryList,MATCH(E3,'Competitors&Timetable'!$A$1:$A$401,0),3)","v":"U11 Girl"},"3;11",11]
[{"$f":"#REF!","v":{"$error":"#REF!"}},{"$f":"#REF!","v":{"$error":"#REF!"}},{"$f":"#REF!","v":{"$error":"#REF!"}},null,11,{"$f":"INDEX(EntryList,MATCH(E4,'Competitors&Timetable'!$A$1:$A$401,0),2)","v":"Holli Boyd"},{"$f":"INDEX(EntryList,MATCH(E4,'Competitors&Timetable'!$A$1:$A$401,0),3)","v":"U11 Girl"},"2;97",11]
[{"$f":"#REF!","v":{"$error":"#REF!"}},{"$f":"#REF!","v":{"$error":"#REF!"}},{"$f":"#REF!","v":{"$error":"#REF!"}},null,15,{"$f":"INDEX(EntryList,MATCH(E5,'Competitors&Timetable'!$A$1:$A$401,0),2)","v":"Megan McLaughlin"},{"$f":"INDEX(EntryList,MATCH(E5,'Competitors&Timetable'!$A$1:$A$401,0),3)","v":"U11 Girl"},"2;50",7]
[{"$f":"#REF!","v":{"$error":"#REF!"}},{"$f":"#REF!","v":{"$error":"#REF!"}},{"$f":"#REF!","v":{"$error":"#REF!"}},null,14,{"$f":"INDEX(EntryList,MATCH(E6,'Competitors&Timetable'!$A$1:$A$401,0),2)","v":"Ellie Baxter"},{"$f":"INDEX(EntryList,MATCH(E6,'Competitors&Timetable'!$A$1:$A$401,0),3)","v":"U11 Girl"},"2,22",6]
[{"$f":"#REF!","v":{"$error":"#REF!"}},{"$f":"#REF!","v":{"$error":"#REF!"}},{"$f":"#REF!","v":{"$error":"#REF!"}},null,".",{"$f":"INDEX(EntryList,MATCH(E7,'Competitors&Timetable'!$A$1:$A$401,0),2)","v":" "},{"$f":"INDEX(EntryList,MATCH(E7,'Competitors&Timetable'!$A$1:$A$401,0),3)","v":" "}]
[{"$f":"#REF!","v":{"$error":"#REF!"}},{"$f":"#REF!","v":{"$error":"#REF!"}},{"$f":"#REF!","v":{"$error":"#REF!"}},null,".",{"$f":"INDEX(EntryList,MATCH(E8,'Competitors&Timetable'!$A$1:$A$401,0),2)","v":" "},{"$f":"INDEX(EntryList,MATCH(E8,'Competitors&Timetable'!$A$1:$A$401,0),3)","v":" "},null,null,null,".",{"$f":"INDEX(EntryList,MATCH(K8,'Competitors&Timetable'!A1:A401,0),2)","v":" "},{"$f":"INDEX(EntryList,MATCH(K8,'Competitors&Timetable'!A1:A401,0),3)","v":" "}]
[{"$f":"#REF!","v":{"$error":"#REF!"}},{"$f":"#REF!","v":{"$error":"#REF!"}},{"$f":"#REF!","v":{"$error":"#REF!"}},null,".",{"$f":"INDEX(EntryList,MATCH(E9,'Competitors&Timetable'!$A$1:$A$401,0),2)","v":" "},{"$f":"INDEX(EntryList,MATCH(E9,'Competitors&Timetable'!$A$1:$A$401,0),3)","v":" "},null,null,null,".",{"$f":"INDEX(EntryList,MATCH(K9,'Competitors&Timetable'!A1:A401,0),2)","v":" "},{"$f":"INDEX(EntryList,MATCH(K9,'Competitors&Timetable'!A1:A401,0),3)","v":" "}]
[null,null,null,null,".",{"$f":"INDEX(EntryList,MATCH(E10,'Competitors&Timetable'!$A$1:$A$401,0),2)","v":" "},{"$f":"INDEX(EntryList,MATCH(E10,'Competitors&Timetable'!$A$1:$A$401,0),3)","v":" "}]
{"$rows_left_out":423}
{"sheet":"Instructions","index":5,"n_rows":14,"n_cols":4,"rows_kept":14,"cut":false,"hidden":false,"merged":[[13,0,13,6],[8,0,8,6],[9,0,9,6],[10,0,10,6],[11,0,11,6],[4,0,4,6],[5,0,5,6],[6,0,6,6],[7,0,7,6],[12,0,12,6]]}
["Meadowbank Stadium","LAC T&F Championships","22nd September 2013","Ziska Sports"]
[]
[]
[]
[]
["Instructions"]
["Enter the Competitors Bib Nos. and concantenated names and Clubs in Worksheet 'Competitors&Timetable'."]
["Enter the timetable in Columns F & G in the worksheet 'Competitors&Timetable' using the Format T01 / F01 for 'event number' and the description under 'event' ."]
["Entering Results. For each event, against each position , enter position, bib number, and the performance. If there is a tie with other athletes above, enter an '=' after the place ie 2= . Athletes and Club names will appear automatically. Remember to remove the position ie (7) (8) when an athlete does not start and enter the relevant abbreviations ie (DNS), does not finish (DNF), no heights (NH), or no throws (NT) in the performance cell."]
[]
{"$rows_left_out":5}
{"sheet":"Competitors&Timetable","index":6,"n_rows":239,"n_cols":10,"rows_kept":239,"cut":false,"hidden":false,"merged":[]}
["Bib Number","Name","Club",null,null,"Event No.","Event","Age Group"]
[1,"Jeremy Saville","RJT Group",null,null,"."," "," ",null,"Column1"]
[2,"Catrine Scothorne","RJT Group",null,null,"T01","70m Hurdles Under 13 Girls","Heat 1 of 2",null,"Final"]
[3,"Erin Darling","RJT Group",null,null,"T02","75m Hurdles U15 Girls/13 Boys and 80m Hurdles U17 Women","Final",null,"Heat 1"]
[4,"Adam Shepherd","RJT Group",null,null,"T03","100m Under 11 Girls","Final",null,"Heat 2"]
[5,"Amy Kristoffersen","RJT Group",null,null,"T04","100m Under 11 Boys","Final",null,"Heat 3"]
[6,"Matthew Cartledge","RJT Group",null,null,"T05","100m U13 Girls","Heat 1 of 2",null,"Heat 4"]
[7,"Mary Henderson","RJT Group",null,null,null,null,null,null,"Heat 5"]
[8,"Amy McLaughlin","RJT Group",null,null,"T06","100m Under 13 Boys","Final",null,"Heat 6"]
[9,"Jack Martin","RJT Group",null,null,"T07","100m Under 15 Girls","Heat  1 of 2",null,"Heat 7"]
{"$rows_left_out":229}